Reaction Details
TargetAdenosine receptor A2a/A2b
LigandBDBM50004571
Substrate/Competitorn/a
Meas. Tech.ChEMBL_30716 (CHEMBL646483)
Ki 5.1±n/a nM
Citation Suzuki, FShimada, JMizumoto, HKarasawa, AKubo, KNonaka, HIshii, AKawakita, T Adenosine A1 antagonists. 2. Structure-activity relationships on diuretic activities and protective effects against acute renal failure. J Med Chem35:3066-75 (1992) Adenosine receptor A2a/A2b
Name:Adenosine receptor A2a/A2b
Synonyms:Adenosine A2 receptor
Type:n/a
Mol. Mass.:n/a
Description:ASSAY_ID of ChEMBL is 30560
Components:This complex has 2 components.
Component 1
Name:Adenosine receptor A2b
Type:PROTEIN
Mol. Mass.:36378.84
Organism:Rattus norvegicus
Description:ChEMBL_32934
Residue:332
Component 2
Name:Adenosine receptor A2a
Synonyms:AA2AR_RAT Adenosine A2 receptor Adenosine Receptors A2a (A2a) Adenosine receptors A2a Rat striatal adenosine A2a receptor
Type:G Protein-Coupled Receptor (GPCR)
Mol. Mass.:45015.65
Organism:Rattus norvegicus (rat)
Description:Rat A2A receptors expressed in CHO cells.
Residue:410
BDBM50004571
NameBDBM50004571
Synonyms:8-Chloro-1-phenyl-[1,2,4]triazolo[4,3-a]quinoxalin-4-ylamine CP-66713
TypeSmall organic molecule
Emp. Form.C15H10ClN5
Mol. Mass.295.726
SMILESNc1nc2ccc(Cl)cc2n2c(nnc12)-c1ccccc1