Reaction Details
TargetPlasminogen
LigandBDBM50368379
Substrate/Competitorn/a
Meas. Tech.ChEBML_155603
Ki 157000±n/a nM
Citation Cheng, LGoodwin, CASchully, MFKakkar, VVClaeson, G Synthesis and biological activity of ketomethylene pseudopeptide analogues as thrombin inhibitors. J Med Chem35:3364-9 (1992) Plasminogen
Name:Plasminogen
Type:Protein
Mol. Mass.:90541.87
Organism:Rattus norvegicus
Description:Q01177
Residue:812
BDBM50368379
NameBDBM50368379
Synonyms:CHEMBL1202120
TypeSmall organic molecule
Emp. Form.C34H47N7O4
Mol. Mass.617.7815
SMILES[#7]-[#6@H](-[#6](-c1ccccc1)-c1ccccc1)-[#6](=O)-[#7]-1-[#6]-[#6]-[#6]-[#6@H]-1-[#6](=O)-[#7]-[#6](-[#6]-[#6]-[#6]\[#7]=[#6](\[#7])-[#7])-[#6](=O)-[#6]-[#6]-[#6](=O)-[#7]-1-[#6]-[#6]-[#6]-[#6]-[#6]-1