Reaction Details
TargetReverse transcriptase/RNaseH
LigandBDBM50002692
Substrate/Competitorn/a
Meas. Tech.ChEBML_195198
IC50 40±n/a nM
Citation Bergstrom, DEMott, AWDe Clercq, EBalzarini, JSwartling, DJ 3',3'-Difluoro-3'-deoxythymidine: comparison of anti-HIV activity to 3'-fluoro-3'-deoxythymidine. J Med Chem35:3369-72 (1992) Reverse transcriptase/RNaseH
Name:Reverse transcriptase/RNaseH
Type:PROTEIN
Mol. Mass.:65229.15
Organism:Human immunodeficiency virus 1
Description:ChEMBL_1473730
Residue:566
BDBM50002692
NameBDBM50002692
Synonyms:(AZT) 1-(4-Azido-5-hydroxymethyl-tetrahydro-furan-2-yl)-5-methyl-1H-pyrimidine-2,4-dione 1-((2R,4R,5S)-4-azido-5-(hydroxymethyl)tetrahydrofuran-2-yl)-5-methylpyrimidine-2,4(1H,3H)-dione 1-((2R,4S,5S)-4-Azido-5-hydroxymethyl-tetrahydro-furan-2-yl)-5-methyl-1H-pyrimidine-2,4-dione 1-((2R,4S,5S)-4-azido-5-(hydroxymethyl)tetrahydrofuran-2-yl)-5-methylpyrimidine-2,4(1H,3H)-dione 1-((2S,4R,5R)-4-Azido-5-hydroxymethyl-tetrahydro-furan-2-yl)-5-methyl-1H-pyrimidine-2,4-dione 1-(4-Azido-5-hydroxymethyl-tetrahydro-furan-2-yl)-5-methyl-1H-pyrimidine-2,4-dione (AZT) 1-(4-Azido-5-hydroxymethyl-tetrahydro-furan-2-yl)-5-methyl-1H-pyrimidine-2,4-dione (N3ddThd) 1-(4-Azido-5-hydroxymethyl-tetrahydro-furan-2-yl)-5-methyl-1H-pyrimidine-2,4-dione(3'-azido-2',3'-dideoxythymidine) 1-(4-Azido-5-hydroxymethyl-tetrahydro-furan-2-yl)-5-methyl-1H-pyrimidine-2,4-dione(Zidovudine, AZT) 3'-Azido-3'-deoxy-thymidine 3'-azido-2',3'-dideoxythymidine 3'azido-2'3'-dideoxythymidine 4-(4-Azido-5-hydroxy-tetrahydro-furan-2-yl)-5-methyl-3H-pyrazine-2,6-dione BW-A-509U CHEMBL129 US10071110, Compound AZT ZIDOVUDINE zidovudin | zudovidine
TypeSmall organic molecule
Emp. Form.C10H13N5O4
Mol. Mass.267.2413
SMILESCc1cn([C@H]2C[C@H](N=[N+]=[N-])[C@@H](CO)O2)c(=O)[nH]c1=O