Reaction Details
TargetGag-Pol polyprotein [489-587]
LigandBDBM50004790
Substrate/Competitorn/a
Meas. Tech.ChEBML_79800
IC50 14000±n/a nM
Citation DeCamp, DLBabé, LMSalto, RLucich, JLKoo, MSKahl, SBCraik, CS Specific inhibition of HIV-1 protease by boronated porphyrins. J Med Chem35:3426-8 (1992) Gag-Pol polyprotein [489-587]
Name:Gag-Pol polyprotein [489-587]
Type:Enzyme Subunit
Mol. Mass.:10781.16
Organism:Human immunodeficiency virus type 1
Description:P04585[489-587]
Residue:99
BDBM50004790
NameBDBM50004790
Synonyms:CHEMBL384612 | Porphyrin analogue
TypeSmall organic molecule
Emp. Form.C78H62N4O12
Mol. Mass.1247.3465
SMILESCc1c(CCC(O)=O)c2cc3nc(cc4[nH]c(cc5[nH]c(cc1n2)c(C)c5C(COC(=O)c1ccc2ccccc2c1)OC(=O)c1ccc2ccccc2c1)c(C)c4C(COC(=O)c1ccc2ccccc2c1)OC(=O)c1ccc2ccccc2c1)c(C)c3CCC(O)=O