Reaction Details
TargetGag-Pol polyprotein [489-587]
LigandBDBM50212827
Substrate/Competitorn/a
Meas. Tech.ChEMBL_159302 (CHEMBL769355)
IC50<1±n/a nM
Citation DeCamp, DLBabé, LMSalto, RLucich, JLKoo, MSKahl, SBCraik, CS Specific inhibition of HIV-1 protease by boronated porphyrins. J Med Chem35:3426-8 (1992) Gag-Pol polyprotein [489-587]
Name:Gag-Pol polyprotein [489-587]
Type:Enzyme Subunit
Mol. Mass.:10781.16
Organism:Human immunodeficiency virus type 1
Description:P04585[489-587]
Residue:99
BDBM50212827
NameBDBM50212827
Synonyms:CHEMBL3350189
TypeSmall organic molecule
Emp. Form.C45H61N7O7
Mol. Mass.812.0085
SMILESCC[C@H](C)[C@H](NC(=O)[C@H](C(C)C)[C@@H](O)[C@H](O)[C@H](CC1CCCCC1)NC(=O)[C@H](Cc1c[nH]cn1)NC(=O)COc1cccc2ccccc12)C(=O)NCc1ccccn1