Reaction Details
TargetPol polyprotein
LigandBDBM50004783
Substrate/Competitorn/a
Meas. Tech.ChEBML_159124
IC50 1550±n/a nM
Citation DeCamp, DLBabé, LMSalto, RLucich, JLKoo, MSKahl, SBCraik, CS Specific inhibition of HIV-1 protease by boronated porphyrins. J Med Chem35:3426-8 (1992) Pol polyprotein
Name:Pol polyprotein
Synonyms:Human immunodeficiency virus type 2 pol protein
Type:PROTEIN
Mol. Mass.:100453.78
Organism:Human immunodeficiency virus 2
Description:ChEMBL_159124
Residue:876
BDBM50004783
NameBDBM50004783
TypeSmall organic molecule
Emp. Form.C54H54N4O12
Mol. Mass.951.0262
SMILESCc1c(CCC(O)=O)c2cc3nc(cc4[nH]c(cc5[nH]c(cc1n2)c(C)c5C(COC(=O)C1=CCC1)OC(=O)C1=CCC1)c(C)c4C(COC(=O)C1=CCC1)OC(=O)C1=CCC1)c(C)c3CCC(O)=O