Reaction Details
TargetPlatelet-activating factor receptor
LigandBDBM50002827
Substrate/Competitorn/a
Meas. Tech.ChEMBL_154984 (CHEMBL765337)
Ki 2.9±n/a nM
Citation Girotra, NNBiftu, TPonpipom, MMActon, JJAlberts, AWBach, TNBall, RGBugianesi, RLParsons, WHChabala, JC Development, synthesis, and biological evaluation of (-)-trans-(2S,5S)-2-[3-[(2-oxopropyl)sulfonyl]-4-n-propoxy-5-(3- hydroxypropoxy)-phenyl]-5-(3,4,5-trimethoxyphenyl)tetrahydrofuran, a potent orally active platelet-activating factor (PAF) antagonist and its water-soluble prodrug phosphate ester. J Med Chem35:3474-82 (1992) Platelet-activating factor receptor
Name:Platelet-activating factor receptor
Type:Enzyme Catalytic Domain
Mol. Mass.:39219.60
Organism:Homo sapiens (Human)
Description:PAF Platelet activating factor PTAFR HUMAN::P25105
Residue:342
BDBM50002827
NameBDBM50002827
Synonyms:1-{3-(3-Hydroxy-propoxy)-2-propoxy-5-[(2S,5S)-5-(3,4,5-trimethoxy-phenyl)-tetrahydro-furan-2-yl]-benzenesulfonyl}-propan-2-one | CHEMBL118105
TypeSmall organic molecule
Emp. Form.C28H38O10S
Mol. Mass.566.66
SMILESCCCOc1c(OCCCO)cc(cc1S(=O)(=O)CC(C)=O)[C@@H]1CC[C@H](O1)c1cc(OC)c(OC)c(OC)c1