Reaction Details
TargetPlatelet-activating factor receptor
LigandBDBM81972
Substrate/Competitorn/a
Meas. Tech.ChEBML_154987
Ki 9±n/a nM
Citation Girotra, NNBiftu, TPonpipom, MMActon, JJAlberts, AWBach, TNBall, RGBugianesi, RLParsons, WHChabala, JC Development, synthesis, and biological evaluation of (-)-trans-(2S,5S)-2-[3-[(2-oxopropyl)sulfonyl]-4-n-propoxy-5-(3- hydroxypropoxy)-phenyl]-5-(3,4,5-trimethoxyphenyl)tetrahydrofuran, a potent orally active platelet-activating factor (PAF) antagonist and its water-soluble prodrug phosphate ester. J Med Chem35:3474-82 (1992) Platelet-activating factor receptor
Name:Platelet-activating factor receptor
Type:Enzyme Catalytic Domain
Mol. Mass.:39219.60
Organism:Homo sapiens (Human)
Description:PAF Platelet activating factor PTAFR HUMAN::P25105
Residue:342
BDBM81972
NameBDBM81972
Synonyms:(S)-(+)-ALPHA-METHYL-1H-IMIDAZOLE-4-ETHANAMINE DIHYDROBROMIDE CAS_75614-93-6
TypeSmall organic molecule
Emp. Form.C6H11N3
Mol. Mass.125.1716
SMILESC[C@H](N)Cc1cnc[nH]1