Reaction Details
TargetAdenosine receptor A2a/A2b
LigandBDBM50453221
Substrate/Competitorn/a
Meas. Tech.ChEBML_30704
Ki 7.5±n/a nM
Citation Matsuda, AShinozaki, MYamaguchi, THomma, HNomoto, RMiyasaka, TWatanabe, YAbiru, T Nucleosides and nucleotides. 103. 2-Alkynyladenosines: a novel class of selective adenosine A2 receptor agonists with potent antihypertensive effects. J Med Chem35:241-52 (1992) Adenosine receptor A2a/A2b
Name:Adenosine receptor A2a/A2b
Synonyms:Adenosine A2 receptor
Type:n/a
Mol. Mass.:n/a
Description:ASSAY_ID of ChEMBL is 30560
Components:This complex has 2 components.
Component 1
Name:Adenosine receptor A2b
Type:PROTEIN
Mol. Mass.:36378.84
Organism:Rattus norvegicus
Description:ChEMBL_32934
Residue:332
Component 2
Name:Adenosine receptor A2a
Synonyms:AA2AR_RAT Adenosine A2 receptor Adenosine Receptors A2a (A2a) Adenosine receptors A2a Rat striatal adenosine A2a receptor
Type:G Protein-Coupled Receptor (GPCR)
Mol. Mass.:45015.65
Organism:Rattus norvegicus (rat)
Description:Rat A2A receptors expressed in CHO cells.
Residue:410
BDBM50453221
NameBDBM50453221
Synonyms:CHEMBL2113510
TypeSmall organic molecule
Emp. Form.C15H19N5O4
Mol. Mass.333.3425
SMILESCCCC#Cc1nc(N)c2ncn([C@@H]3O[C@H](CO)[C@@H](O)[C@H]3O)c2n1