Reaction Details
TargetGag-Pol polyprotein [489-587]
LigandBDBM50368411
Substrate/Competitorn/a
Meas. Tech.ChEBML_157563
Ki 71±n/a nM
Citation Rich, DHPrasad, JVSun, CQGreen, JMueller, RHouseman, KMacKenzie, DMalkovsky, M New hydroxyethylamine HIV protease inhibitors that suppress viral replication. J Med Chem35:3803-12 (1992) Gag-Pol polyprotein [489-587]
Name:Gag-Pol polyprotein [489-587]
Type:Enzyme Subunit
Mol. Mass.:10781.16
Organism:Human immunodeficiency virus type 1
Description:P04585[489-587]
Residue:99
BDBM50368411
NameBDBM50368411
Synonyms:CHEMBL1790882 | CHEMBL3349493
TypeSmall organic molecule
Emp. Form.C40H53N7O7
Mol. Mass.743.8915
SMILES[H][C@@](O)(CN1CCCC1C(=O)N[C@@H]([C@@H](C)CC)C(=O)NCCc1ccccn1)[C@H](Cc1ccccc1)NC(=O)[C@H](CC(N)=O)NC(=O)OCc1ccccc1