Reaction Details
TargetGag-Pol polyprotein [489-587]
LigandBDBM50368426
Substrate/Competitorn/a
Meas. Tech.ChEBML_157563
Ki 2.5±n/a nM
Citation Rich, DHPrasad, JVSun, CQGreen, JMueller, RHouseman, KMacKenzie, DMalkovsky, M New hydroxyethylamine HIV protease inhibitors that suppress viral replication. J Med Chem35:3803-12 (1992) Gag-Pol polyprotein [489-587]
Name:Gag-Pol polyprotein [489-587]
Type:Enzyme Subunit
Mol. Mass.:10781.16
Organism:Human immunodeficiency virus type 1
Description:P04585[489-587]
Residue:99
BDBM50368426
NameBDBM50368426
Synonyms:CHEMBL1790892 | CHEMBL3349502
TypeSmall organic molecule
Emp. Form.C41H55N7O8
Mol. Mass.773.9175
SMILES[H][C@@](O)(CN1CCCC1C(=O)N[C@@H]([C@@H](C)CC)C(=O)N[C@@H](C(C)C)C(=O)OC)[C@H](Cc1ccccc1)NC(=O)[C@H](CC(N)=O)NC(=O)c1ccc2ccccc2n1