Reaction Details
TargetGag-Pol polyprotein [489-587]
LigandBDBM50368430
Substrate/Competitorn/a
Meas. Tech.ChEBML_157563
Ki 0.240000±n/a nM
Citation Rich, DHPrasad, JVSun, CQGreen, JMueller, RHouseman, KMacKenzie, DMalkovsky, M New hydroxyethylamine HIV protease inhibitors that suppress viral replication. J Med Chem35:3803-12 (1992) Gag-Pol polyprotein [489-587]
Name:Gag-Pol polyprotein [489-587]
Type:Enzyme Subunit
Mol. Mass.:10781.16
Organism:Human immunodeficiency virus type 1
Description:P04585[489-587]
Residue:99
BDBM50368430
NameBDBM50368430
Synonyms:CHEMBL1790874 | CHEMBL3349485
TypeSmall organic molecule
Emp. Form.C42H68N8O11
Mol. Mass.861.0363
SMILES[H][C@@](O)(CN1CCC[C@H]1C(=O)N[C@@H]([C@@H](C)CC)C(=O)N[C@@H](C(C)C)C(=O)OC)[C@H](Cc1ccccc1)NC(=O)[C@H](CC(N)=O)NC(=O)[C@H](CC(C)C)NC(=O)[C@H](CO)NC(C)=O