Reaction Details
TargetCarbonic anhydrase 2
LigandBDBM50003244
Substrate/Competitorn/a
Meas. Tech.ChEMBL_45064 (CHEMBL659847)
Ki 4±n/a nM
Citation Hartman, GDHalczenko, WSmith, RLSugrue, MFMallorga, PJMichelson, SRRandall, WCSchwam, HSondey, JM 4-substituted thiophene- and furan-2-sulfonamides as topical carbonic anhydrase inhibitors. J Med Chem35:3822-31 (1992) Carbonic anhydrase 2
Name:Carbonic anhydrase 2
Type:Enzyme
Mol. Mass.:29250.71
Organism:Homo sapiens (Human)
Description:P00918
Residue:260
BDBM50003244
NameBDBM50003244
Synonyms:4-(3-Diethylaminomethyl-4-hydroxy-benzenesulfonyl)-furan-2-sulfonic acid amide; hydrochloride | CHEMBL538536
TypeSmall organic molecule
Emp. Form.C15H20N2O6S2
Mol. Mass.388.459
SMILESCCN(CC)Cc1cc(ccc1O)S(=O)(=O)c1coc(c1)S(N)(=O)=O