Reaction Details
TargetCarbonic anhydrase 2
LigandBDBM50003245
Substrate/Competitorn/a
Meas. Tech.ChEBML_45064
Ki 6.5±n/a nM
Citation Hartman, GDHalczenko, WSmith, RLSugrue, MFMallorga, PJMichelson, SRRandall, WCSchwam, HSondey, JM 4-substituted thiophene- and furan-2-sulfonamides as topical carbonic anhydrase inhibitors. J Med Chem35:3822-31 (1992) Carbonic anhydrase 2
Name:Carbonic anhydrase 2
Type:Enzyme
Mol. Mass.:29250.71
Organism:Homo sapiens (Human)
Description:P00918
Residue:260
BDBM50003245
NameBDBM50003245
Synonyms:4-[4-(Isobutylamino-methyl)-benzenesulfonyl]-thiophene-2-sulfonic acid amide; hydrochloride | CHEMBL543415
TypeSmall organic molecule
Emp. Form.C15H20N2O4S3
Mol. Mass.388.525
SMILESCC(C)CNCc1ccc(cc1)S(=O)(=O)c1csc(c1)S(N)(=O)=O