Reaction Details
TargetOxytocin receptor
LigandBDBM81894
Substrate/Competitorn/a
Meas. Tech.ChEMBL_149181 (CHEMBL762744)
Ki 1.3±n/a nM
Citation Williams, PDBock, MGTung, RDGarsky, VMPerlow, DSErb, JMLundell, GFGould, NPWhitter, WLHoffman, JB Development of a novel class of cyclic hexapeptide oxytocin antagonists based on a natural product. J Med Chem35:3905-18 (1992) Oxytocin receptor
Name:Oxytocin receptor
Type:Enzyme Catalytic Domain
Mol. Mass.:42889.28
Organism:RAT
Description:Oxytocin OXTR RAT::P70536
Residue:388
BDBM81894
NameBDBM81894
Synonyms:Cyclo[L-Pro-D-Trp-L-Ile-1,6-didehydro-D-Pyz-L-Pip-D-His-] L-366,875
TypeSmall organic molecule
Emp. Form.C39H50N10O6
Mol. Mass.754.8777
SMILESCC[C@H](C)[C@@H]1NC(=O)[C@@H](Cc2c[nH]c3ccccc23)NC(=O)[C@@H]2CCCN2C(=O)[C@@H](Cc2cnc[nH]2)NC(=O)[C@@H]2CCCCN2C(=O)[C@H]2CCC=NN2C1=O