Reaction Details
TargetSigma non-opioid intracellular receptor 1
LigandBDBM50002197
Substrate/Competitorn/a
Meas. Tech.ChEBML_201877
Ki 3±n/a nM
Citation Gilligan, PJCain, GAChristos, TECook, LDrummond, SJohnson, ALKergaye, AAMcElroy, JFRohrbach, KWSchmidt, WK Novel piperidine sigma receptor ligands as potential antipsychotic drugs. J Med Chem35:4344-61 (1992) Sigma non-opioid intracellular receptor 1
Name:Sigma non-opioid intracellular receptor 1
Type:Enzyme Catalytic Domain
Mol. Mass.:25246.51
Organism:Mus musculus (Mouse)
Description:O55242
Residue:223
BDBM50002197
NameBDBM50002197
Synonyms:1-(1-Benzyl-piperidin-4-yl)-3-(4-fluoro-phenyl)-propan-2-one; compound with but-2-enedioic acid | CHEMBL334466
TypeSmall organic molecule
Emp. Form.C21H24FNO
Mol. Mass.325.4198
SMILESFc1ccc(CC(=O)CC2CCN(Cc3ccccc3)CC2)cc1