Reaction Details
TargetSigma non-opioid intracellular receptor 1
LigandBDBM50036737
Substrate/Competitorn/a
Meas. Tech.ChEBML_201133
IC50 32±n/a nM
Citation Yevich, JPNew, JSLobeck, WGDextraze, PBernstein, ETaylor, DPYocca, FDEison, MSTemple, DL Synthesis and biological characterization of alpha-(4-fluorophenyl)-4-(5-fluoro-2-pyrimidinyl)-1-piperazinebutanol and analogues as potential atypical antipsychotic agents. J Med Chem35:4516-25 (1993) Sigma non-opioid intracellular receptor 1
Name:Sigma non-opioid intracellular receptor 1
Type:Enzyme Catalytic Domain
Mol. Mass.:25124.85
Organism:Homo sapiens (Human)
Description:Q99720
Residue:223
BDBM50036737
NameBDBM50036737
Synonyms:(R)-1-(4-Fluoro-phenyl)-4-[4-(5-fluoro-pyrimidin-2-yl)-piperazin-1-yl]-butan-1-ol | CHEMBL129768
TypeSmall organic molecule
Emp. Form.C18H22F2N4O
Mol. Mass.348.3903
SMILESO[C@H](CCCN1CCN(CC1)c1ncc(F)cn1)c1ccc(F)cc1