Reaction Details
TargetKappa-type opioid receptor
LigandBDBM50001713
Substrate/Competitorn/a
Meas. Tech.ChEBML_145206
IC50 4.9±n/a nM
Citation Klein, PNelson, WL O3-(2-carbomethoxyallyl) ethers of opioid ligands derived from oxymorphone, naltrexone, etorphine, diprenorphine, norbinaltorphimine, and naltrindole. Unexpected O3-dealkylation in the opioid radioligand displacement assay. J Med Chem35:4589-94 (1993) Kappa-type opioid receptor
Name:Kappa-type opioid receptor
Type:G Protein-Coupled Receptor (GPCR)
Mol. Mass.:42744.99
Organism:Cavia porcellus (domestic guinea pig)
Description:P41144
Residue:380
BDBM50001713
NameBDBM50001713
Synonyms:CHEMBL143815 | methyl 2-[19-(1-hydroxy-1-methylbutyl)-15-methoxy-3-methyl-13-oxa-3-azahexacyclo[13.2.2.12,8.01,6.06,14.07,12]icosa-7(12),8,10,16-tetraen-11-yloxymethyl]acrylate
TypeSmall organic molecule
Emp. Form.C30H39NO6
Mol. Mass.509.6338
SMILESCCC[C@@](C)(O)[C@H]1C[C@]23C=C[C@]1(OC)[C@@H]1Oc4c5c(C[C@H]2N(C)CC[C@@]315)ccc4OCC(=C)C(=O)OC