Reaction Details
TargetKappa-type opioid receptor
LigandBDBM50001715
Substrate/Competitorn/a
Meas. Tech.ChEBML_145206
IC50 8.3±n/a nM
Citation Klein, PNelson, WL O3-(2-carbomethoxyallyl) ethers of opioid ligands derived from oxymorphone, naltrexone, etorphine, diprenorphine, norbinaltorphimine, and naltrindole. Unexpected O3-dealkylation in the opioid radioligand displacement assay. J Med Chem35:4589-94 (1993) Kappa-type opioid receptor
Name:Kappa-type opioid receptor
Type:G Protein-Coupled Receptor (GPCR)
Mol. Mass.:42744.99
Organism:Cavia porcellus (domestic guinea pig)
Description:P41144
Residue:380
BDBM50001715
NameBDBM50001715
Synonyms:CHEMBL407685 | Norbinaltorphimine3,3'-diether
TypeSmall organic molecule
Emp. Form.C50H55N3O10
Mol. Mass.857.9858
SMILESCOC(=O)C(=C)COc1ccc2C[C@H]3N(CC4CC4)CC[C@@]45[C@@H](Oc1c24)c1[nH]c2[C@@H]4Oc6c7c(C[C@H]8N(CC9CC9)CC[C@@]47[C@@]8(O)Cc2c1C[C@@]35O)ccc6OCC(=C)C(=O)OC