Reaction Details
TargetKappa-type opioid receptor
LigandBDBM50002345
Substrate/Competitorn/a
Meas. Tech.ChEBML_145347
Ki 0.029000±n/a nM
Citation Choi, HMurray, TFDeLander, GECaldwell, VAldrich, JV N-terminal alkylated derivatives of [D-Pro10]dynorphin A-(1-11) are highly selective for kappa-opioid receptors. J Med Chem35:4638-9 (1993) Kappa-type opioid receptor
Name:Kappa-type opioid receptor
Type:G Protein-Coupled Receptor (GPCR)
Mol. Mass.:42744.99
Organism:Cavia porcellus (domestic guinea pig)
Description:P41144
Residue:380
BDBM50002345
NameBDBM50002345
Synonyms:CHEMBL407529 [N-benzylTyr1, D-pro10]Dynorphin A(1-11)
TypeSmall organic molecule
Emp. Form.C70H109N21O13
Mol. Mass.1452.7474
SMILESCC[C@H](C)[C@H](NC(=O)[C@H](CCCNC(N)=N)NC(=O)[C@H](CCCNC(N)=N)NC(=O)[C@H](CC(C)C)NC(=O)[C@H](Cc1ccccc1)NC(=O)CNC(=O)CNC(=O)[C@H](Cc1ccc(O)cc1)NCc1ccccc1)C(=O)N[C@@H](CCCNC(N)=N)C(=O)N1CCC[C@@H]1C(=O)N[C@@H](CCCCN)C(O)=O