Reaction Details
TargetKappa-type opioid receptor
LigandBDBM50002350
Substrate/Competitorn/a
Meas. Tech.ChEBML_145347
Ki 0.049000±n/a nM
Citation Choi, HMurray, TFDeLander, GECaldwell, VAldrich, JV N-terminal alkylated derivatives of [D-Pro10]dynorphin A-(1-11) are highly selective for kappa-opioid receptors. J Med Chem35:4638-9 (1993) Kappa-type opioid receptor
Name:Kappa-type opioid receptor
Type:G Protein-Coupled Receptor (GPCR)
Mol. Mass.:42744.99
Organism:Cavia porcellus (domestic guinea pig)
Description:P41144
Residue:380
BDBM50002350
NameBDBM50002350
Synonyms:CHEMBL265387 | [N-allylTyr1, D-pro10]Dynorphin A(1-11)
TypeSmall organic molecule
Emp. Form.C66H107N21O13
Mol. Mass.1402.6887
SMILESCC[C@H](C)[C@H](NC(=O)[C@H](CCCNC(N)=N)NC(=O)[C@H](CCCNC(N)=N)NC(=O)[C@H](CC(C)C)NC(=O)[C@H](Cc1ccccc1)NC(=O)CNC(=O)CNC(=O)[C@H](Cc1ccc(O)cc1)NCC=C)C(=O)N[C@@H](CCCNC(N)=N)C(=O)N1CCC[C@@H]1C(=O)N[C@@H](CCCCN)C(O)=O