Reaction Details
TargetSigma non-opioid intracellular receptor 1
LigandBDBM11638
Substrate/Competitorn/a
Meas. Tech.ChEMBL_226544 (CHEMBL846484)
IC50>10000±n/a nM
Citation Kimes, ASWilson, AAScheffel, UCampbell, BGLondon, ED Radiosynthesis, cerebral distribution, and binding of [125I]-1-(p-iodophenyl)-3-(1-adamantyl)guanidine, a ligand for sigma binding sites. J Med Chem35:4683-9 (1993) Sigma non-opioid intracellular receptor 1
Name:Sigma non-opioid intracellular receptor 1
Type:Enzyme Catalytic Domain
Mol. Mass.:25124.85
Organism:Homo sapiens (Human)
Description:Q99720
Residue:223
BDBM11638
NameBDBM11638
Synonyms:CHEMBL26 N-[(1-ethylpyrrolidin-2-yl)methyl]-2-methoxy-5-sulfamoylbenzamide SULPIRIDE,(-) Sulpiride, SLP US10172837, Sulpiride
TypeSmall organic molecule
Emp. Form.C15H23N3O4S
Mol. Mass.341.426
SMILESCCN1CCCC1CNC(=O)c1cc(ccc1OC)S(N)(=O)=O