Reaction Details
TargetType-1 angiotensin II receptor B
LigandBDBM50004164
Substrate/Competitorn/a
Meas. Tech.ChEBML_217980
Ki 8.3±n/a nM
Citation Atwal, KSAhmed, SZBird, JEDelaney, CLDickinson, KEFerrara, FNHedberg, AMiller, AVMoreland, SO'Reilly, BC Dihydropyrimidine angiotensin II receptor antagonists. J Med Chem35:4751-63 (1993) Type-1 angiotensin II receptor B
Name:Type-1 angiotensin II receptor B
Type:Enzyme Catalytic Domain
Mol. Mass.:40929.44
Organism:RAT
Description:Angiotensin II AT1B 0 RAT::P29089
Residue:359
BDBM50004164
NameBDBM50004164
Synonyms:2-Butyl-4-chloro-6-methyl-1-[2'-(1H-tetrazol-5-yl)-biphenyl-4-ylmethyl]-1,6-dihydro-pyrimidine-5-carboxylic acid ethyl ester; potassium | CHEMBL141659
TypeSmall organic molecule
Emp. Form.C26H28ClN6O2
Mol. Mass.491.993
SMILESCCCCC1=NC(Cl)=C(C(C)N1Cc1ccc(cc1)-c1ccccc1-c1nn[n-]n1)C(=O)OCC