Reaction Details
TargetReverse transcriptase/RNaseH
LigandBDBM50368508
Substrate/Competitorn/a
Meas. Tech.ChEMBL_196935 (CHEMBL803952)
IC50 122000±n/a nM
Citation Tan, GTWickramasinghe, ABaba, MHughes, SHMohan, PPezzuto, JMSingh, RVerma, S Potential anti-AIDS naphthalenesulfonic acid derivatives. Synthesis and inhibition of HIV-1 induced cytopathogenesis and HIV-1 and HIV-2 reverse transcriptase activities. J Med Chem35:4846-53 (1992) Reverse transcriptase/RNaseH
Name:Reverse transcriptase/RNaseH
Type:PROTEIN
Mol. Mass.:65229.15
Organism:Human immunodeficiency virus 1
Description:ChEMBL_1473730
Residue:566
BDBM50368508
NameBDBM50368508
Synonyms:CHEMBL1788186
TypeSmall organic molecule
Emp. Form.C30H28N2O16S4
Mol. Mass.800.809
SMILESOc1cc(cc2cc(cc(NC(=O)CCCCCCCCC(=O)Nc3cc(cc4cc(cc(O)c34)S([O-])(=O)=O)S([O-])(=O)=O)c12)S([O-])(=O)=O)S([O-])(=O)=O