Reaction Details
TargetReverse transcriptase/RNaseH
LigandBDBM50368514
Substrate/Competitorn/a
Meas. Tech.ChEMBL_196935 (CHEMBL803952)
IC50>1000000±n/a nM
Citation Tan, GTWickramasinghe, ABaba, MHughes, SHMohan, PPezzuto, JMSingh, RVerma, S Potential anti-AIDS naphthalenesulfonic acid derivatives. Synthesis and inhibition of HIV-1 induced cytopathogenesis and HIV-1 and HIV-2 reverse transcriptase activities. J Med Chem35:4846-53 (1992) Reverse transcriptase/RNaseH
Name:Reverse transcriptase/RNaseH
Type:PROTEIN
Mol. Mass.:65229.15
Organism:Human immunodeficiency virus 1
Description:ChEMBL_1473730
Residue:566
BDBM50368514
NameBDBM50368514
Synonyms:CHEMBL1744150
TypeSmall organic molecule
Emp. Form.C15H13NO10S2
Mol. Mass.431.396
SMILESOC(=O)CCCC(=O)Nc1cc(cc2cc(cc(O)c12)S([O-])(=O)=O)S([O-])(=O)=O