Reaction Details
TargetReverse transcriptase/RNaseH
LigandBDBM50368506
Substrate/Competitorn/a
Meas. Tech.ChEMBL_196935 (CHEMBL803952)
IC50 452000±n/a nM
Citation Tan, GTWickramasinghe, ABaba, MHughes, SHMohan, PPezzuto, JMSingh, RVerma, S Potential anti-AIDS naphthalenesulfonic acid derivatives. Synthesis and inhibition of HIV-1 induced cytopathogenesis and HIV-1 and HIV-2 reverse transcriptase activities. J Med Chem35:4846-53 (1992) Reverse transcriptase/RNaseH
Name:Reverse transcriptase/RNaseH
Type:PROTEIN
Mol. Mass.:65229.15
Organism:Human immunodeficiency virus 1
Description:ChEMBL_1473730
Residue:566
BDBM50368506
NameBDBM50368506
Synonyms:CHEMBL1744156
TypeSmall organic molecule
Emp. Form.C10H8NO8S2
Mol. Mass.334.303
SMILESNc1c(O)c2c(O)cc(cc2cc1S(O)(=O)=O)S([O-])(=O)=O