Reaction Details
TargetAdenosine receptor A1
LigandBDBM50003019
Substrate/Competitorn/a
Meas. Tech.ChEBML_29305
Ki 1.3±n/a nM
Citation Jacobson, KAvan Galen, PJWilliams, M Adenosine receptors: pharmacology, structure-activity relationships, and therapeutic potential. J Med Chem35:407-22 (1992) Adenosine receptor A1
Name:Adenosine receptor A1
Type:Protein
Mol. Mass.:36704.13
Organism:Rattus norvegicus (rat)
Description:n/a
Residue:326
BDBM50003019
NameBDBM50003019
Synonyms:8-(Hexahydro-2,5-methano-pentalen-3a-yl)-1,3-dipropyl-3,7-dihydro-purine-2,6-dione KW-3902
TypeSmall organic molecule
Emp. Form.C20H28N4O2
Mol. Mass.356.4619
SMILESCCCn1c2nc([nH]c2c(=O)n(CCC)c1=O)C12CC3CC1CC(C2)C3