Reaction Details
Target5-hydroxytryptamine receptor 1A/1B/1D/1F
LigandBDBM50001861
Substrate/Competitorn/a
Meas. Tech.ChEMBL_801 (CHEMBL615781)
Ki 33±n/a nM
Citation Scott, MKMartin, GEDiStefano, DLFedde, CLKukla, MJBarrett, DLBaldy, WJElgin, RJKesslick, JMMathiasen, JR Pyrrole mannich bases as potential antipsychotic agents. J Med Chem35:552-8 (1992) 5-hydroxytryptamine receptor 1A/1B/1D/1F
Name:5-hydroxytryptamine receptor 1A/1B/1D/1F
Synonyms:Serotonin 1 (5-HT1) receptor
Type:n/a
Mol. Mass.:n/a
Description:ASSAY_ID of ChEMBL is 193825
Components:This complex has 4 components.
Component 1
Name:5-hydroxytryptamine receptor 1D
Type:Enzyme Catalytic Domain
Mol. Mass.:41551.75
Organism:RAT
Description:5-HT1D HTR1D RAT::P28565
Residue:374
Component 2
Name:5-hydroxytryptamine receptor 1A
Synonyms:5-HT-1A 5-HT1A 5-hydroxytryptamine receptor 1A (5HT1A) 5ht1a Htr1a Serotonin 1a (5-HT1a) receptor/Adrenergic receptor alpha-1 | Serotonin receptor 1A
Type:G Protein-Coupled Receptor (GPCR)
Mol. Mass.:46445.29
Organism:Rattus norvegicus (rat)
Description:Binding assays were performed using rat hippocampal membranes.
Residue:422
Component 3
Name:5-hydroxytryptamine receptor 1B
Synonyms:5-HT-1B 5-hydroxytryptamine receptor 1B (5HT1B) 5ht1b Serotonin 1 (5-HT1) receptor Serotonin receptor 1B
Type:Protein
Mol. Mass.:43173.33
Organism:Rattus norvegicus (Rat)
Description:P28564
Residue:386
Component 4
Name:5-hydroxytryptamine receptor 1F
Synonyms:5-HT-1F 5-hydroxytryptamine receptor 1F 5ht1f Serotonin 1 (5-HT1) receptor Serotonin receptor 1F
Type:Enzyme Catalytic Domain
Mol. Mass.:41896.93
Organism:RAT
Description:5-HT1F HTR1F RAT::P30940
Residue:366
BDBM50001861
NameBDBM50001861
Synonyms:1-{5-[4-(2-Isopropoxy-phenyl)-piperazin-1-ylmethyl]-1H-pyrrol-2-ylmethyl}-piperidin-2-one | CHEMBL434512
TypeSmall organic molecule
Emp. Form.C24H34N4O2
Mol. Mass.410.5524
SMILESCC(C)Oc1ccccc1N1CCN(Cc2ccc(CN3CCCCC3=O)[nH]2)CC1