Reaction Details
TargetNeutrophil elastase
LigandBDBM50005154
Substrate/Competitorn/a
Meas. Tech.ChEMBL_63659 (CHEMBL878146)
IC50 65±n/a nM
Citation Skiles, JWFuchs, VMiao, CSorcek, RGrozinger, KGMauldin, SCVitous, JMui, PWJacober, SChow, G Inhibition of human leukocyte elastase (HLE) by N-substituted peptidyl trifluoromethyl ketones. J Med Chem35:641-62 (1992) Neutrophil elastase
Name:Neutrophil elastase
Type:Enzyme
Mol. Mass.:28532.38
Organism:Homo sapiens (Human)
Description:P08246
Residue:267
BDBM50005154
NameBDBM50005154
Synonyms:CHEMBL423067 | {2-Methyl-1-[2-(3,3,3-trifluoro-1-isopropyl-2-oxo-propylcarbamoyl)-pyrrolidine-1-carbonyl]-propyl}-carbamic acid tert-butyl ester
TypeSmall organic molecule
Emp. Form.C21H34F3N3O5
Mol. Mass.465.507
SMILESCC(C)C(NC(=O)OC(C)(C)C)C(=O)N1CCCC1C(=O)NC(C(C)C)C(=O)C(F)(F)F