Reaction Details
Target5-hydroxytryptamine receptor 3A/3B
LigandBDBM50000492
Substrate/Competitorn/a
Meas. Tech.ChEMBL_2987 (CHEMBL621504)
Ki 1.5±n/a nM
Citation Youssefyeh, RDCampbell, HFKlein, SAirey, JEDarkes, PPowers, MSchnapper, MNeuenschwander, KFitzpatrick, LRPendley, CE Development of high-affinity 5-HT3 receptor antagonists. 1. Initial structure-activity relationship of novel benzamides. J Med Chem35:895-903 (1992) 5-hydroxytryptamine receptor 3A/3B
Name:5-hydroxytryptamine receptor 3A/3B
Type:n/a
Mol. Mass.:n/a
Description:ASSAY_ID of EBI is 2974
Components:This complex has 2 components.
Component 1
Name:5-hydroxytryptamine receptor 3B
Synonyms:5HT3B_RAT Serotonin (5-HT) receptor
Type:PROTEIN
Mol. Mass.:50328.78
Organism:Rattus norvegicus
Description:EBI_11885
Residue:437
Component 2
Name:5-hydroxytryptamine receptor 3A
Synonyms:5-HT3 5HT3A_RAT Htr3 Serotonin (5-HT) receptor | Zacopride site-R
Type:Enzyme Catalytic Domain
Mol. Mass.:55428.70
Organism:RAT
Description:5-HT3 HTR3A RAT::P35563
Residue:483
BDBM50000492
NameBDBM50000492
Synonyms:(zacopride)4-Amino-N-(1-aza-bicyclo[2.2.2]oct-3-yl)-5-chloro-2-methoxy-benzamide 4-Amino-N-(1-aza-bicyclo[2.2.2]oct-3-yl)-5-chloro-2-methoxy-benzamide (Zacopride) CHEMBL18041 ZACOPRIDE ZACOPRIDE,RS | ZACOPRIDE,S
TypeSmall organic molecule
Emp. Form.C15H20ClN3O2
Mol. Mass.309.791
SMILESCOc1cc(N)c(Cl)cc1C(=O)NC1CN2CCC1CC2