Reaction Details
TargetAdenosine receptor A1
LigandBDBM50267577
Substrate/Competitorn/a
Meas. Tech.ChEMBL_28993 (CHEMBL643468)
Ki 0.910±n/a nM
Citation Shimada, JSuzuki, FNonaka, HIshii, A 8-Polycycloalkyl-1,3-dipropylxanthines as potent and selective antagonists for A1-adenosine receptors. J Med Chem35:924-30 (1992) Adenosine receptor A1
Name:Adenosine receptor A1
Type:Protein
Mol. Mass.:36704.13
Organism:Rattus norvegicus (rat)
Description:n/a
Residue:326
BDBM50267577
NameBDBM50267577
Synonyms:CHEMBL489640 | N6-((+/-)-endo-norborn-2-yl)adenosine
TypeSmall organic molecule
Emp. Form.C17H23N5O4
Mol. Mass.361.3956
SMILESOC[C@H]1O[C@H]([C@H](O)[C@@H]1O)n1cnc2c(NC3CC4CCC3C4)ncnc12