Reaction Details
TargetMuscarinic acetylcholine receptor M1
LigandBDBM50005495
Substrate/Competitorn/a
Meas. Tech.ChEMBL_138559 (CHEMBL745515)
IC50 810±n/a nM
Citation Sowell, JWTang, YValli, MJChapman, JMUsher, LAVaughan, CMKosh, JW Synthesis and cholinergic properties of bis[[(dimethylamino)methyl]furanyl] analogues of ranitidine. J Med Chem35:1102-8 (1992) Muscarinic acetylcholine receptor M1
Name:Muscarinic acetylcholine receptor M1
Type:Enzyme Catalytic Domain
Mol. Mass.:51400.50
Organism:Mus musculus
Description:Cholinergic, muscarinic 0 0::Q52KQ0
Residue:460
BDBM50005495
NameBDBM50005495
Synonyms:CHEMBL13166 | {5-[5-(5-Dimethylaminomethyl-furan-2-ylmethylsulfanyl)-pentylsulfanylmethyl]-furan-2-ylmethyl}-dimethyl-amine
TypeSmall organic molecule
Emp. Form.C21H34N2O2S2
Mol. Mass.410.637
SMILESCN(C)Cc1ccc(CSCCCCCSCc2ccc(CN(C)C)o2)o1