Reaction Details
TargetMuscarinic acetylcholine receptor M1
LigandBDBM50005496
Substrate/Competitorn/a
Meas. Tech.ChEBML_138664
IC50 410±n/a nM
Citation Sowell, JWTang, YValli, MJChapman, JMUsher, LAVaughan, CMKosh, JW Synthesis and cholinergic properties of bis[[(dimethylamino)methyl]furanyl] analogues of ranitidine. J Med Chem35:1102-8 (1992) Muscarinic acetylcholine receptor M1
Name:Muscarinic acetylcholine receptor M1
Type:Enzyme Catalytic Domain
Mol. Mass.:51400.50
Organism:Mus musculus
Description:Cholinergic, muscarinic 0 0::Q52KQ0
Residue:460
BDBM50005496
NameBDBM50005496
Synonyms:CHEMBL13426 | {5-[7-(5-Dimethylaminomethyl-furan-2-ylmethylsulfanyl)-heptylsulfanylmethyl]-furan-2-ylmethyl}-dimethyl-amine
TypeSmall organic molecule
Emp. Form.C23H38N2O2S2
Mol. Mass.438.69
SMILESCN(C)Cc1ccc(CSCCCCCCCSCc2ccc(CN(C)C)o2)o1