Reaction Details
TargetAcetylcholinesterase
LigandBDBM50005493
Substrate/Competitorn/a
Meas. Tech.ChEBML_28737
IC50 290±n/a nM
Citation Sowell, JWTang, YValli, MJChapman, JMUsher, LAVaughan, CMKosh, JW Synthesis and cholinergic properties of bis[[(dimethylamino)methyl]furanyl] analogues of ranitidine. J Med Chem35:1102-8 (1992) Acetylcholinesterase
Name:Acetylcholinesterase
Type:Enzyme
Mol. Mass.:67792.70
Organism:Homo sapiens (Human)
Description:P22303
Residue:614
BDBM50005493
NameBDBM50005493
Synonyms:CHEMBL12858 | N-((5-Ethylsulfanylmethyl-furan-2-ylmethyl)-dimethyl-amine)l-N-[1-(((5-Ethylsulfanylmethyl-furan-2-ylmethyl)-dimethyl-amine)amino)-2-cynovinyl]amine
TypeSmall organic molecule
Emp. Form.C22H34N6O2S2
Mol. Mass.478.674
SMILES[#6]-[#7](-[#6])-[#6]-c1ccc(-[#6]-[#16]-[#6]-[#6]-[#7]\[#6](-[#7]-[#6]-[#6]-[#16]-[#6]-c2ccc(-[#6]-[#7](-[#6])-[#6])o2)=[#7]/C#N)o1