Reaction Details
TargetMuscarinic acetylcholine receptor M2
LigandBDBM50005492
Substrate/Competitorn/a
Meas. Tech.ChEBML_139893
IC50 400±n/a nM
Citation Sowell, JWTang, YValli, MJChapman, JMUsher, LAVaughan, CMKosh, JW Synthesis and cholinergic properties of bis[[(dimethylamino)methyl]furanyl] analogues of ranitidine. J Med Chem35:1102-8 (1992) Muscarinic acetylcholine receptor M2
Name:Muscarinic acetylcholine receptor M2
Type:PROTEIN
Mol. Mass.:51515.43
Organism:Mus musculus
Description:ChEMBL_139897
Residue:466
BDBM50005492
NameBDBM50005492
Synonyms:CHEMBL418712 | {5-[9-(5-Dimethylaminomethyl-furan-2-ylmethylsulfanyl)-nonylsulfanylmethyl]-furan-2-ylmethyl}-dimethyl-amine
TypeSmall organic molecule
Emp. Form.C25H42N2O2S2
Mol. Mass.466.743
SMILESCN(C)Cc1ccc(CSCCCCCCCCCSCc2ccc(CN(C)C)o2)o1