Reaction Details
TargetCholinesterase
LigandBDBM50005498
Substrate/Competitorn/a
Meas. Tech.ChEMBL_41721 (CHEMBL659267)
IC50 1300±n/a nM
Citation Sowell, JWTang, YValli, MJChapman, JMUsher, LAVaughan, CMKosh, JW Synthesis and cholinergic properties of bis[[(dimethylamino)methyl]furanyl] analogues of ranitidine. J Med Chem35:1102-8 (1992) Cholinesterase
Name:Cholinesterase
Type:Homotetramer
Mol. Mass.:68422.27
Organism:Homo sapiens (Human)
Description:P06276
Residue:602
BDBM50005498
NameBDBM50005498
Synonyms:CHEMBL12781 | {5-[4'-(5-Dimethylaminomethyl-furan-2-ylmethylsulfanylmethyl)-biphenyl-4-ylmethylsulfanylmethyl]-furan-2-ylmethyl}-dimethyl-amine
TypeSmall organic molecule
Emp. Form.C30H36N2O2S2
Mol. Mass.520.749
SMILESCN(C)Cc1ccc(CSCc2ccc(cc2)-c2ccc(CSCc3ccc(CN(C)C)o3)cc2)o1