Reaction Details
TargetCholinesterase
LigandBDBM50005501
Substrate/Competitorn/a
Meas. Tech.ChEMBL_41721 (CHEMBL659267)
IC50 4100±n/a nM
Citation Sowell, JWTang, YValli, MJChapman, JMUsher, LAVaughan, CMKosh, JW Synthesis and cholinergic properties of bis[[(dimethylamino)methyl]furanyl] analogues of ranitidine. J Med Chem35:1102-8 (1992) Cholinesterase
Name:Cholinesterase
Type:Homotetramer
Mol. Mass.:68422.27
Organism:Homo sapiens (Human)
Description:P06276
Residue:602
BDBM50005501
NameBDBM50005501
Synonyms:CHEMBL275537 | {5-[3-(5-Dimethylaminomethyl-furan-2-ylmethylsulfanyl)-propylsulfanylmethyl]-furan-2-ylmethyl}-dimethyl-amine
TypeSmall organic molecule
Emp. Form.C19H30N2O2S2
Mol. Mass.382.584
SMILESCN(C)Cc1ccc(CSCCCSCc2ccc(CN(C)C)o2)o1