Reaction Details
TargetAcetylcholinesterase
LigandBDBM22893
Substrate/Competitorn/a
Meas. Tech.ChEMBL_28634 (CHEMBL644790)
IC50 2300±n/a nM
Citation Sowell, JWTang, YValli, MJChapman, JMUsher, LAVaughan, CMKosh, JW Synthesis and cholinergic properties of bis[[(dimethylamino)methyl]furanyl] analogues of ranitidine. J Med Chem35:1102-8 (1992) Acetylcholinesterase
Name:Acetylcholinesterase
Type:Enzyme
Mol. Mass.:67792.70
Organism:Homo sapiens (Human)
Description:P22303
Residue:614
BDBM22893
NameBDBM22893
Synonyms:CHEMBL512 ZANTAC | dimethyl[(5-{[(2-{[(E)-1-(methylamino)-2-nitroethenyl]amino}ethyl)sulfanyl]methyl}furan-2-yl)methyl]amine
TypeSmall organic molecule
Emp. Form.C13H22N4O3S
Mol. Mass.314.404
SMILESCN\C([CH-][N+]([O-])=O)=[NH+]/CCSCc1ccc(CN(C)C)o1