Reaction Details
TargetAcetylcholinesterase
LigandBDBM50005502
Substrate/Competitorn/a
Meas. Tech.ChEBML_28737
IC50 260±n/a nM
Citation Sowell, JWTang, YValli, MJChapman, JMUsher, LAVaughan, CMKosh, JW Synthesis and cholinergic properties of bis[[(dimethylamino)methyl]furanyl] analogues of ranitidine. J Med Chem35:1102-8 (1992) Acetylcholinesterase
Name:Acetylcholinesterase
Type:Enzyme
Mol. Mass.:67792.70
Organism:Homo sapiens (Human)
Description:P22303
Residue:614
BDBM50005502
NameBDBM50005502
Synonyms:CHEMBL12472 | {5-[4-(5-Dimethylaminomethyl-furan-2-ylmethylsulfanylmethyl)-benzylsulfanylmethyl]-furan-2-ylmethyl}-dimethyl-amine
TypeSmall organic molecule
Emp. Form.C24H32N2O2S2
Mol. Mass.444.653
SMILESCN(C)Cc1ccc(CSCc2ccc(CSCc3ccc(CN(C)C)o3)cc2)o1