Reaction Details
TargetAcetylcholinesterase
LigandBDBM50005509
Substrate/Competitorn/a
Meas. Tech.ChEBML_28737
IC50 740±n/a nM
Citation Sowell, JWTang, YValli, MJChapman, JMUsher, LAVaughan, CMKosh, JW Synthesis and cholinergic properties of bis[[(dimethylamino)methyl]furanyl] analogues of ranitidine. J Med Chem35:1102-8 (1992) Acetylcholinesterase
Name:Acetylcholinesterase
Type:Enzyme
Mol. Mass.:67792.70
Organism:Homo sapiens (Human)
Description:P22303
Residue:614
BDBM50005509
NameBDBM50005509
Synonyms:CHEMBL268499 | {5-[6-(5-Dimethylaminomethyl-furan-2-ylmethylsulfanyl)-hexylsulfanylmethyl]-furan-2-ylmethyl}-dimethyl-amine
TypeSmall organic molecule
Emp. Form.C22H36N2O2S2
Mol. Mass.424.663
SMILESCN(C)Cc1ccc(CSCCCCCCSCc2ccc(CN(C)C)o2)o1