Reaction Details
TargetAminopeptidase N
LigandBDBM50002020
Substrate/Competitorn/a
Meas. Tech.ChEBML_35491
IC50 90±n/a nM
Citation Fournié-Zaluski, MCCoric, PTurcaud, SBruetschy, LLucas, ENoble, FRoques, BP Potent and systemically active aminopeptidase N inhibitors designed from active-site investigation. J Med Chem35:1259-66 (1992) Aminopeptidase N
Name:Aminopeptidase N
Type:Protein
Mol. Mass.:108810.25
Organism:Sus scrofa (Pig)
Description:P15145
Residue:963
BDBM50002020
NameBDBM50002020
Synonyms:2-Benzylsulfanyl-1-mercaptomethyl-ethyl-ammonium
TypeSmall organic molecule
Emp. Form.C10H16NS2
Mol. Mass.214.37
SMILES[NH3+]C(CS)CSCc1ccccc1