Reaction Details
TargetAminopeptidase N
LigandBDBM50002034
Substrate/Competitorn/a
Meas. Tech.ChEMBL_35492 (CHEMBL646402)
IC50 25±n/a nM
Citation Fournié-Zaluski, MCCoric, PTurcaud, SBruetschy, LLucas, ENoble, FRoques, BP Potent and systemically active aminopeptidase N inhibitors designed from active-site investigation. J Med Chem35:1259-66 (1992) Aminopeptidase N
Name:Aminopeptidase N
Type:Protein
Mol. Mass.:108810.25
Organism:Sus scrofa (Pig)
Description:P15145
Residue:963
BDBM50002034
NameBDBM50002034
Synonyms:2-Mercapto-1-phenyl-ethyl-ammonium
TypeSmall organic molecule
Emp. Form.C8H12NS
Mol. Mass.154.252
SMILES[NH3+]C(CS)c1ccccc1