Reaction Details
TargetNeprilysin
LigandBDBM50002018
Substrate/Competitorn/a
Meas. Tech.ChEBML_144637
IC50 4.5±n/a nM
Citation Fournié-Zaluski, MCCoric, PTurcaud, SBruetschy, LLucas, ENoble, FRoques, BP Potent and systemically active aminopeptidase N inhibitors designed from active-site investigation. J Med Chem35:1259-66 (1992) Neprilysin
Name:Neprilysin
Type:Enzyme
Mol. Mass.:85505.38
Organism:Homo sapiens (Human)
Description:P08473
Residue:750
BDBM50002018
NameBDBM50002018
Synonyms:2-(2-Mercaptomethyl-3-phenyl-propionylamino)-4-methyl-pentanoic acid | CHEMBL442337
TypeSmall organic molecule
Emp. Form.C16H23NO3S
Mol. Mass.309.424
SMILESCC(C)C[C@@H](NC(=O)C(CS)Cc1ccccc1)C(O)=O