Reaction Details
TargetNeprilysin
LigandBDBM50002035
Substrate/Competitorn/a
Meas. Tech.ChEBML_144637
IC50 15±n/a nM
Citation Fournié-Zaluski, MCCoric, PTurcaud, SBruetschy, LLucas, ENoble, FRoques, BP Potent and systemically active aminopeptidase N inhibitors designed from active-site investigation. J Med Chem35:1259-66 (1992) Neprilysin
Name:Neprilysin
Type:Enzyme
Mol. Mass.:85505.38
Organism:Homo sapiens (Human)
Description:P08473
Residue:750
BDBM50002035
NameBDBM50002035
Synonyms:(2-Hydroxycarbamoyl-3-phenyl-propionylamino)-acetic acid CHEMBL17107
TypeSmall organic molecule
Emp. Form.C12H14N2O5
Mol. Mass.266.25
SMILESONC(=O)C(Cc1ccccc1)C(=O)NCC(O)=O