Reaction Details
TargetGag-Pol polyprotein [489-587]
LigandBDBM50005687
Substrate/Competitorn/a
Meas. Tech.ChEMBL_159482 (CHEMBL769442)
IC50 180±n/a nM
Citation Tam, TFCarrière, JMacDonald, DCastelhano, ALPliura, DHDewdney, NJThomas, EMBach, CBarnett, JChan, H Intriguing structure-activity relations underlie the potent inhibition of HIV protease by norstatine-based peptides. J Med Chem35:1318-20 (1992) Gag-Pol polyprotein [489-587]
Name:Gag-Pol polyprotein [489-587]
Type:Enzyme Subunit
Mol. Mass.:10781.16
Organism:Human immunodeficiency virus type 1
Description:P04585[489-587]
Residue:99
BDBM50005687
NameBDBM50005687
Synonyms:1-[3-(2-Benzyloxycarbonylamino-3-carbamoyl-propionylamino)-2-hydroxy-4-phenyl-butyl]-pyrrolidine-2-carboxylic acid tert-butyl ester CHEMBL115292
TypeSmall organic molecule
Emp. Form.C31H42N4O7
Mol. Mass.582.6878
SMILESCC(C)(C)OC(=O)[C@@H]1CCCN1C[C@H](O)[C@H](Cc1ccccc1)NC(=O)[C@H](CC(N)=O)NC(=O)OCc1ccccc1