Reaction Details
TargetGag-Pol polyprotein [489-587]
LigandBDBM50005688
Substrate/Competitorn/a
Meas. Tech.ChEMBL_157548 (CHEMBL763135)
Ki 0.400000±n/a nM
Citation Tam, TFCarrière, JMacDonald, DCastelhano, ALPliura, DHDewdney, NJThomas, EMBach, CBarnett, JChan, H Intriguing structure-activity relations underlie the potent inhibition of HIV protease by norstatine-based peptides. J Med Chem35:1318-20 (1992) Gag-Pol polyprotein [489-587]
Name:Gag-Pol polyprotein [489-587]
Type:Enzyme Subunit
Mol. Mass.:10781.16
Organism:Human immunodeficiency virus type 1
Description:P04585[489-587]
Residue:99
BDBM50005688
NameBDBM50005688
Synonyms:CHEMBL3085518 | N*1*-[1-Benzyl-3-(2-tert-butylcarbamoyl-pyrrolidin-1-yl)-2-hydroxy-3-oxo-propyl]-2-[2-(naphthalen-1-yloxy)-acetylamino]-succinamide
TypeSmall organic molecule
Emp. Form.C35H43N5O7
Mol. Mass.645.7452
SMILESCC(C)(C)NC(=O)[C@@H]1CCCN1C(=O)[C@@H](O)[C@H](Cc1ccccc1)NC(=O)[C@H](CC(N)=O)NC(=O)COc1cccc2ccccc12