Reaction Details
Target5-hydroxytryptamine receptor 1A/1B/1D/1F
LigandBDBM50005833
Substrate/Competitorn/a
Meas. Tech.ChEMBL_799 (CHEMBL615403)
Ki>10000±n/a nM
Citation Flynn, DLZabrowski, DLBecker, DPNosal, RVillamil, CIGullikson, GWMoummi, CYang, DC SC-53116: the first selective agonist at the newly identified serotonin 5-HT4 receptor subtype. J Med Chem35:1486-9 (1992) 5-hydroxytryptamine receptor 1A/1B/1D/1F
Name:5-hydroxytryptamine receptor 1A/1B/1D/1F
Synonyms:Serotonin 1 (5-HT1) receptor
Type:n/a
Mol. Mass.:n/a
Description:ASSAY_ID of ChEMBL is 193825
Components:This complex has 4 components.
Component 1
Name:5-hydroxytryptamine receptor 1D
Type:Enzyme Catalytic Domain
Mol. Mass.:41551.75
Organism:RAT
Description:5-HT1D HTR1D RAT::P28565
Residue:374
Component 2
Name:5-hydroxytryptamine receptor 1A
Synonyms:5-HT-1A 5-HT1A 5-hydroxytryptamine receptor 1A (5HT1A) 5ht1a Htr1a Serotonin 1a (5-HT1a) receptor/Adrenergic receptor alpha-1 | Serotonin receptor 1A
Type:G Protein-Coupled Receptor (GPCR)
Mol. Mass.:46445.29
Organism:Rattus norvegicus (rat)
Description:Binding assays were performed using rat hippocampal membranes.
Residue:422
Component 3
Name:5-hydroxytryptamine receptor 1B
Synonyms:5-HT-1B 5-hydroxytryptamine receptor 1B (5HT1B) 5ht1b Serotonin 1 (5-HT1) receptor Serotonin receptor 1B
Type:Protein
Mol. Mass.:43173.33
Organism:Rattus norvegicus (Rat)
Description:P28564
Residue:386
Component 4
Name:5-hydroxytryptamine receptor 1F
Synonyms:5-HT-1F 5-hydroxytryptamine receptor 1F 5ht1f Serotonin 1 (5-HT1) receptor Serotonin receptor 1F
Type:Enzyme Catalytic Domain
Mol. Mass.:41896.93
Organism:RAT
Description:5-HT1F HTR1F RAT::P30940
Residue:366
BDBM50005833
NameBDBM50005833
Synonyms:(exo)4-Amino-5-chloro-N-(hexahydro-pyrrolizin-1-ylmethyl)-2-methoxy-benzamide 4-Amino-5-chloro-N-(hexahydro-pyrrolizin-2-ylmethyl)-2-methoxy-benzamide 4-amino-5-chloro-N-[(1S-cis-hexahydro-1H-pyrrolizin-1-yl)-methyl]-2-methoxybenzenecarboxamide SC-53116 SC53116
TypeSmall organic molecule
Emp. Form.C16H22ClN3O2
Mol. Mass.323.818
SMILESCOc1cc(N)c(Cl)cc1C(=O)NC[C@@H]1CCN2CCC[C@@H]12