Reaction Details
TargetAlpha-1A adrenergic receptor
LigandBDBM50031475
Substrate/Competitorn/a
Meas. Tech.ChEBML_33282
Ki>10000±n/a nM
Citation Flynn, DLZabrowski, DLBecker, DPNosal, RVillamil, CIGullikson, GWMoummi, CYang, DC SC-53116: the first selective agonist at the newly identified serotonin 5-HT4 receptor subtype. J Med Chem35:1486-9 (1992) Alpha-1A adrenergic receptor
Name:Alpha-1A adrenergic receptor
Type:Protein
Mol. Mass.:51620.15
Organism:Rattus norvegicus (Rat)
Description:P43140
Residue:466
BDBM50031475
NameBDBM50031475
Synonyms:4-Amino-N-(1-aza-bicyclo[2.2.2]oct-3-yl)-5-chloro-2-((R)-methoxy)-benzamide 4-Amino-N-(R)-1-aza-bicyclo[2.2.2]oct-3-yl-5-chloro-2-methoxy-benzamide ZACOPRIDE,S
TypeSmall organic molecule
Emp. Form.C15H20ClN3O2
Mol. Mass.309.791
SMILESCOc1cc(N)c(Cl)cc1C(=O)N[C@H]1CN2CCC1CC2