Reaction Details
TargetD(2) dopamine receptor
LigandBDBM50368604
Substrate/Competitorn/a
Meas. Tech.ChEBML_62245
Ki>10000±n/a nM
Citation Flynn, DLZabrowski, DLBecker, DPNosal, RVillamil, CIGullikson, GWMoummi, CYang, DC SC-53116: the first selective agonist at the newly identified serotonin 5-HT4 receptor subtype. J Med Chem35:1486-9 (1992) D(2) dopamine receptor
Name:D(2) dopamine receptor
Type:G Protein-Coupled Receptor (GPCR)
Mol. Mass.:50931.60
Organism:Rattus norvegicus (rat)
Description:P61169
Residue:444
BDBM50368604
NameBDBM50368604
Synonyms:CHEMBL1907770
TypeSmall organic molecule
Emp. Form.C15H18ClN3O2
Mol. Mass.307.775
SMILES[H]C12CN3C[C@]1(NC(=O)c1cc(Cl)c(N)cc1OC)C2CC3