Reaction Details
TargetEndothelin-1 receptor
LigandBDBM50368605
Substrate/Competitorn/a
Meas. Tech.ChEMBL_63372 (CHEMBL676108)
Ki 4200±n/a nM
Citation Doherty, AM Endothelin: a new challenge. J Med Chem35:1493-508 (1992) Endothelin-1 receptor
Name:Endothelin-1 receptor
Type:Enzyme Catalytic Domain
Mol. Mass.:48256.91
Organism:RAT
Description:ENDOTHELIN A EDNRA RAT::P26684
Residue:426
BDBM50368605
NameBDBM50368605
Synonyms:CHEMBL1790178
TypeSmall organic molecule
Emp. Form.C103H147N27O37S5
Mol. Mass.2515.753
SMILESCC[C@H](C)[C@H](NC(=O)[C@@H](NC(=O)[C@H](CC(O)=O)NC(=O)[C@H](CCC(N)=O)NC(=O)[C@H](Cc1cnc[nH]1)NC(=O)[C@@H]1CSSC[C@@H](N)C(=O)N[C@H]([C@@H](C)O)C(=O)N[C@H]2CSSC[C@@H](NC(=O)[C@H](CCC(O)=O)NC(=O)[C@H](CCC(O)=O)NC(=O)[C@@H](CC(O)=O)NC(=O)[C@@H](NC(=O)[C@@H](CCSC)NC(=O)[C@H](CC(O)=O)NC(=O)[C@@H](CC(N)=O)NC2=O)[C@@H](C)O)C(=O)N[C@@H](CC(C)C)C(=O)N[C@H](CC(N)=O)C(=O)N[C@@H](Cc2ccccc2)C(=O)N1)C(C)C)C(=O)N[C@@H](Cc1c[nH]c2ccccc12)C(O)=O